Versions Compared

Key

  • This line was added.
  • This line was removed.
  • Formatting was changed.

...

Who present in meeting
Commit
Details
Root Cause Analysis

  

Actions


Takeaways

...

30/09/2020 15:30

Who present in meetingAlun, Pete, Andy
Commithttps://stash.forgerock.org/projects/OPENAM/repos/openam/commits/5bb62adb4c75df1f2480ab3e8d767b259adf8498
DetailsFailure in build stage
Root Cause Analysis


 [gcp-gce-jenkins-agent-2] ^[[36mmaven_1  |^[[0m [INFO] ------------------------------------------------------------------------
[gcp-gce-jenkins-agent-2] ^[[36mmaven_1 |^[[0m [INFO] BUILD FAILURE
[gcp-gce-jenkins-agent-2] ^[[36mmaven_1 |^[[0m [INFO] ------------------------------------------------------------------------
[gcp-gce-jenkins-agent-2] ^[[36mmaven_1 |^[[0m [INFO] Total time: 30:34 min
[gcp-gce-jenkins-agent-2] ^[[36mmaven_1 |^[[0m [INFO] Finished at: 2020-09-30T14:21:23Z
[gcp-gce-jenkins-agent-2] ^[[36mmaven_1 |^[[0m [INFO] ------------------------------------------------------------------------
[gcp-gce-jenkins-agent-2] ^[[36mmaven_1 |^[[0m [ERROR] Failed to execute goal org.apache.maven.plugins:maven-archetype-plugin:3.0.1:integration-test (default-integration-test) on project auth-tree-node-archetype:
[gcp-gce-jenkins-agent-2] ^[[36mmaven_1 |^[[0m [ERROR] Archetype IT 'basic' failed: Execution failure: exit code = 1
[gcp-gce-jenkins-agent-2] ^[[36mmaven_1 |^[[0m [ERROR] -> [Help 1]
[gcp-gce-jenkins-agent-2] ^[[36mmaven_1 |^[[0m [ERROR]
[gcp-gce-jenkins-agent-2] ^[[36mmaven_1 |^[[0m [ERROR] To see the full stack trace of the errors, re-run Maven with the -e switch.
[gcp-gce-jenkins-agent-2] ^[[36mmaven_1 |^[[0m [ERROR] Re-run Maven using the -X switch to enable full debug logging.
[gcp-gce-jenkins-agent-2] ^[[36mmaven_1 |^[[0m [ERROR]
[gcp-gce-jenkins-agent-2] ^[[36mmaven_1 |^[[0m [ERROR] For more information about the errors and possible solutions, please read the following articles:
[gcp-gce-jenkins-agent-2] ^[[36mmaven_1 |^[[0m [ERROR] [Help 1] http://cwiki.apache.org/confluence/display/MAVEN/MojoExecutionException
[gcp-gce-jenkins-agent-2] ^[[36mmaven_1 |^[[0m [ERROR]
[gcp-gce-jenkins-agent-2] ^[[36mmaven_1 |^[[0m [ERROR] After correcting the problems, you can resume the build with the command
[gcp-gce-jenkins-agent-2] ^[[36mmaven_1 |^[[0m [ERROR] mvn <goals> -rf :auth-tree-node-archetype
[gcp-gce-jenkins-agent-2] ^[[36mmaster-4811-2-build-1601473774375-maven_maven_1 exited with code 1

Actions

Jira
serverForgeRock JIRA
serverId45b4e541-fe03-30e2-b999-cf4e643b93ec
keyAME-18031
 already exists to cover this

TakeawaysPlugin works a charm

...

30/09/2020 10:45

Who present in meetingEmma, Gabor, Pete, Phil, Rich, Andrew, Andy
Commithttps://stash.forgerock.org/projects/OPENAM/repos/openam/commits/e77dcaecdc1250a167f671764234b699b29a29d6
DetailsPublish artifacts stage showing as skipped even though the FTs are still showing as in progress
Root Cause Analysis

There are two issues here

  1. There were failures in the functional tests - a recurrence of TestSessionResourceV2V3AndV4
  2. An error in the execution of the after hook which locks master, causing the subsequent after hook which updates the stage status to not run

Actions

Takeaways

...